BDBM476842 US10870660, Compound III-624::US11345716, Compound III-624
SMILES Cn1cc2c(cccc2n1)C(=O)NC1CC2(CC(CCN3CCc4sc(OCC(C)(F)F)nc4C3)C2)C1
InChI Key InChIKey=IJKACRJOPXDGDS-UHFFFAOYSA-N
Data  2 KI
  Tab Delimited (TSV)   2D SDfile   Computed 3D by Vconf -m prep SDfile
Find this compound or compounds like it in BindingDB:
Activity Spreadsheet -- Enzyme Inhibition Constant Data from BindingDB
Found 1 hit for monomerid = 476842
TargetD(2) dopamine receptor(Homo sapiens (Human))
Shionogi
US Patent
LigandPNGBDBM476842(US10870660, Compound III-624 | US11345716, Compoun...)
Affinity DataKi:  400nM. Assay description: 225 nL of the solutions of the non-specific ligand or the compounds of the present invention at each concentration (in case of vehicle, final concent...
Ligand InfoPC cidPC sid
In DepthDetails US Patent